{"text_format":"1","workbook":"xlsx","n_sheets":8,"sheets":["1 | Informazioni generali","2 | Personale","3 | Subappaltatori","4 | Tabella Accreditamento","5 | Doc. Sistema di Gestione ","6 | Campioni e strumenti","7 | Allegati","_config"],"not_rendered":{"charts":0,"images":1,"macros":1,"external_links":0,"defined_names":62,"comments":0,"pivot_tables":0},"unopened":[],"bounds":{"document_bytes":16777216,"sheet_cells":100000,"rows_first":2000,"rows_last":500,"rows_between":2000,"halvings":0,"cell_chars":16384,"cell_head_chars":4096},"cells_cut":0,"cells_raw":0,"read":"whole","date_system":"1900"}

{"sheet":"1 | Informazioni generali","index":0,"n_rows":56,"n_cols":14,"rows_kept":56,"cut":false,"hidden":false,"merged":[[0,0,0,3],[34,1,34,11],[11,1,11,11],[3,3,3,11],[4,3,4,11],[23,6,23,11],[5,3,5,11],[6,3,6,11],[7,3,7,11],[23,3,23,4],[17,6,17,9],[21,3,21,4],[13,3,20,4],[13,1,19,1],[13,8,13,9],[13,6,13,7],[25,1,31,1],[25,4,25,11],[26,4,26,11],[27,4,27,11],[31,4,31,11],[28,4,28,11],[29,4,29,11],[30,4,30,11],[47,1,47,10],[36,3,36,9],[38,3,38,9],[40,3,40,9],[41,3,41,9],[42,3,42,9],[45,1,45,10],[44,1,44,10],[15,6,15,11],[19,6,19,9],[21,6,21,9],[37,3,37,9],[39,3,39,9],[35,11,36,11],[35,7,35,9]]}
[]
["DA-09 rev. 00-05"]
[]
[null,"Titolo / Title",null,"Domanda di accreditamento per Produttori di Materiali di Riferimento (RMP)"]
[null,null,null,"Application for Accreditation of Reference Material Producers (RMP)"]
[null,"Sigla / Reference",null,"DA-09"]
[null,"Revisione / Revision",null,"00-05"]
[null,"Data / Date",null,"2018-11-15"]
[]
[]
[]
["1","Generalità"]
[]
[null,"Ragione sociale\ndel CAB",null,null,null,null,"RMP",null,"Numero (se disponibile)"]
[]
[null,null,null,null,null,null,"Indicare eventuali ulteriori accreditamenti del CAB\n(riportare numero, ove applicabile)"]
[]
[null,null,null,null,null,null,"Laboratorio di Taratura (UNI CEI EN ISO/IEC17025)"]
[]
[null,null,null,null,null,null,"Laboratorio di Prova (UNI CEI EN ISO/IEC17025)"]
[]
[null,"Sito web",null,"www.",null,null,"Laboratorio medico (UNI EN ISO 15189)"]
[]
[null,"Domanda di",null,null,null,null,"Selezionare la voce di interesse \n(ogni DA-09 è relativa ad una specifica domanda,\nnon è quindi ammessa la scelta multipla)."]
[]
[null,"Per l'esecuzione di\nproduzione presso:",null,"Luogo / Sito","Indirizzo"]
[null,null,null,"nel Laboratorio principale"]
[]
[]
[]
[]
[]
[]
[]
[null,"Elenco sezioni di cui è composta la presente DA-09:"]
[null,null,null,null,null,null,null,"[Doppio click per selezionare/deselezionare]",null,null,null,"Compilata"]
[null,"Sez. 1",null,"Informazioni generali (questa sezione)"]
[null,"Sez. 2",null,{"$f":"'2 | Personale'!B5","v":"Personale"},null,null,null,null,null,null,null,null,null,{"$f":"IF(L38=\"\",-1,0)","v":-1}]
[null,"Sez. 3",null,{"$f":"'3 | Subappaltatori'!B5","v":"Subappaltatori"},null,null,null,null,null,null,null,null,null,-1]
[null,"Sez. 4",null,{"$f":"'4 | Tabella Accreditamento'!B5","v":"Produzione di Materiali di Riferimento oggetto dell’accreditamento"},null,null,null,null,null,null,null,null,null,-1]
[null,"Sez. 5",null,{"$f":"'5 | Doc. Sistema di Gestione '!B5","v":"Documentazione del Sistema di Gestione - Procedure gestionali e tecniche"},null,null,null,null,null,null,null,null,null,-1]
[null,"Sez. 6",null,{"$f":"'6 | Campioni e strumenti'!B5","v":"Elenco dei campioni e/o strumenti"},null,null,null,null,null,null,null,null,null,-1]
[null,"Sez. 7",null,{"$f":"'7 | Allegati'!B5","v":"Allegati da inviare a corredo della presente domanda"},null,null,null,null,null,null,null,null,null,-1]
[]
[null,"Motivare il caso in cui una o più sezioni non siano state compilate:"]
[]
[]
[null,"Dichiaro che la presente domanda DA-09, annesso specifico alla Domanda di Accreditamento DA-00, è completa in tutte le sezioni richieste fatte salve le motivazioni riportate in precedenza. "]
[]
[null,"Revisione"]
[]
[null,"Data"]
[]
[null,"Timbro del CAB, \nnominativo e firma\ndel Direttore Tecnico (1)"]
[]
[null,"(1)",null,"Si intende Direttore dell’Organismo."]

{"sheet":"2 | Personale","index":1,"n_rows":30,"n_cols":5,"rows_kept":30,"cut":false,"hidden":false,"merged":[[11,1,11,3],[9,1,9,3],[0,0,0,1],[4,1,4,3],[6,1,6,3],[10,1,10,4]]}
[{"$f":"'4 | Tabella Accreditamento'!A1:B1","v":"Dipartimento Laboratori di Taratura"}]
[{"$f":"'1 | Informazioni generali'!A2","v":"DA-09 rev. 00-05"}]
[]
[]
["2","Personale"]
[]
["Scopo:","Fornire informazioni relative al personale dell'organismo, in termini di qualifica e di responsabilità assegnata."]
[]
["Note:"]
["(1)","Titolo di studio. Il curriculum professionale, datato e firmato, deve essere allegato alla presente domanda (cfr. A.3 nella sez. Allegati)."]
["(2)","Selezionare (possibilità di selezione multipla) tra: Direzione (unica); Direzione Tecnica (anche più persone); Responsabile UOD/UOT/UOM (se applicabile, al più uno per ogni UO); Responsabile del Sistema di Gestione (anche più persone); Operatore."]
["(3)","Inserire ogni altra informazione si ritenga utile per meglio descrivere la responsabilità del personale."]
[]
[]
["ID","Nome e Cognome","Qualifica (1)","Ruolo (2)","Note (3)"]
[1,null,null,"Responsabile del Laboratorio"]
[2]
[3]
[4]
[5]
[6]
[7]
[8]
[9]
[10]
[11]
[12]
[13]
[14]
[15]

{"sheet":"3 | Subappaltatori","index":2,"n_rows":27,"n_cols":7,"rows_kept":27,"cut":false,"hidden":false,"merged":[[11,1,11,6],[0,0,0,1],[4,1,4,3],[10,1,10,6],[6,1,6,6],[9,1,9,6],[15,1,17,1],[15,2,17,2],[15,0,17,0],[15,6,17,6],[14,3,14,4],[15,5,17,5],[24,0,26,0],[24,1,26,1],[24,2,26,2],[24,5,26,5],[24,6,26,6],[18,0,20,0],[18,1,20,1],[18,2,20,2],[18,5,20,5],[18,6,20,6],[21,0,23,0],[21,1,23,1],[21,2,23,2],[21,5,23,5],[21,6,23,6]]}
[{"$f":"'4 | Tabella Accreditamento'!A1:B1","v":"Dipartimento Laboratori di Taratura"}]
[{"$f":"'1 | Informazioni generali'!A2","v":"DA-09 rev. 00-05"}]
[]
[]
["3","Subappaltatori"]
[]
["Scopo:","Fornire informazioni relative agli eventuali subappaltatori, ovvero organismi competenti ai quali il produttore di materiali di riferimento affida parte delle attività del processo di produzione.\nSi ricorda che \"subappaltatore\" è organismo (società o organizzazione pubblica o privata) che garantisce aspetti relativi alla lavorazione, alla manipolazione, alla valutazione dell’omogeneità e della stabilità, alla caratterizzazione, all’immagazzinamento o distribuzione dei materiali di riferimento a nome del Produttore di materiali di riferimento su base contrattuale onerosa o non onerosa."]
[]
["Note:"]
["(1)","Riportare l'identificativo di accreditamento, ove applicabile. Lasciare vuoto nel caso il subappaltatore non disponga di accreditamento."]
["(2)","Selezionare (possibilità di selezione multipla) le attività oggetto di subappalto."]
["(3)","Inserire ogni altra informazione si ritenga utile per meglio descrivere il rapporto contrattuale in essere con il subappaltatore (ad esempio, il riferimento al contratto - cfr. A.4 sez. Allegati)."]
[]
[]
["ID","Ragione sociale","Indirizzo","Eventuali accreditamenti (1)",null,"Attività subappaltata (2)","Informazioni contrattuali (3)"]
["SC1",null,null,"Laboratorio di Taratura\n(UNI CEI EN ISO/IEC17025)"]
[null,null,null,"Laboratorio di Prova \n(UNI CEI EN ISO/IEC17025)"]
[null,null,null,"Laboratorio medico \n(UNI EN ISO 15189)"]
["SC2",null,null,"Laboratorio di Taratura\n(UNI CEI EN ISO/IEC17025)"]
[null,null,null,"Laboratorio di Prova \n(UNI CEI EN ISO/IEC17025)"]
[null,null,null,"Laboratorio medico \n(UNI EN ISO 15189)"]
["SC3",null,null,"Laboratorio di Taratura\n(UNI CEI EN ISO/IEC17025)"]
[null,null,null,"Laboratorio di Prova \n(UNI CEI EN ISO/IEC17025)"]
[null,null,null,"Laboratorio medico \n(UNI EN ISO 15189)"]
["SC4",null,null,"Laboratorio di Taratura\n(UNI CEI EN ISO/IEC17025)"]
[null,null,null,"Laboratorio di Prova \n(UNI CEI EN ISO/IEC17025)"]
[null,null,null,"Laboratorio medico \n(UNI EN ISO 15189)"]

{"sheet":"4 | Tabella Accreditamento","index":3,"n_rows":77,"n_cols":13,"rows_kept":77,"cut":false,"hidden":false,"merged":[[15,2,15,3],[6,1,6,8],[10,1,10,7],[11,1,11,7],[0,0,0,1],[9,1,9,7],[12,1,12,7],[4,1,4,10],[1,0,1,1]]}
["Dipartimento Laboratori di Taratura"]
[{"$f":"'1 | Informazioni generali'!A2","v":"DA-09 rev. 00-05"}]
[]
[]
["4","Produzione di Materiali di Riferimento oggetto dell’accreditamento"]
[]
["Scopo:","Indicare i settori (cfr. All. 1 alla presente DA-09), la composizione del materiale (matrice / analita), le propretà caratterizzate, i campi di misura e le incertezze estese per i quali il produttore chiede di essere accreditato"]
[]
["Note:"]
["(1)","Indicare eventuali variazioni rispetto alla attuale tabella di accreditamento (nel caso di domanda di Rinnovo o di Estensione/Riduzione). [Doppio click per selezionare/deselezionare]"]
["(2)","Indicare se si tratta di Materiale di Riferimento Certificato, CRM (Certified Reference Material). [Doppio click per selezionare/deselezionare] "]
["(3)","Indicare il metodo di caratterizzazione con riferimento alla ISO 17034."]
["(4)","Indicare la procedura (o le procedure) relative allo specifico oggetto di accreditamento, utilizzando il relativo ID di cui all'elenco delle procedure (sezione 5).",null,null,null,null,null,null,null,"Vai all'elenco procedure >>>"]
[]
[]
[null,null,"Composizione del materiale"]
["Variazione\n(1)","Settore","Matrice","Analita","CRM\n(2)","Proprietà","Campo di misura \n/ unità di misura","Incertezza estesa \n/ unità di misura","Metodo\n(3)","Procedura di riferimento\n(4)","Note"]
[null,null,null,null,null,null,null,null,null,null,null,null,{"$f":"VLOOKUP(B18,_config!$A$3:$B$41,2)","v":{"$error":"#N/A"}}]
[null,null,null,null,null,null,null,null,null,null,null,null,{"$f":"VLOOKUP(B19,_config!$A$3:$B$41,2)","v":{"$error":"#N/A"}}]
[null,null,null,null,null,null,null,null,null,null,null,null,{"$f":"VLOOKUP(B20,_config!$A$3:$B$41,2)","v":{"$error":"#N/A"}}]
[null,null,null,null,null,null,null,null,null,null,null,null,{"$f":"VLOOKUP(B21,_config!$A$3:$B$41,2)","v":{"$error":"#N/A"}}]
[null,null,null,null,null,null,null,null,null,null,null,null,{"$f":"VLOOKUP(B22,_config!$A$3:$B$41,2)","v":{"$error":"#N/A"}}]
[null,null,null,null,null,null,null,null,null,null,null,null,{"$f":"VLOOKUP(B23,_config!$A$3:$B$41,2)","v":{"$error":"#N/A"}}]
[null,null,null,null,null,null,null,null,null,null,null,null,{"$f":"VLOOKUP(B24,_config!$A$3:$B$41,2)","v":{"$error":"#N/A"}}]
[null,null,null,null,null,null,null,null,null,null,null,null,{"$f":"VLOOKUP(B25,_config!$A$3:$B$41,2)","v":{"$error":"#N/A"}}]
[null,null,null,null,null,null,null,null,null,null,null,null,{"$f":"VLOOKUP(B26,_config!$A$3:$B$41,2)","v":{"$error":"#N/A"}}]
[null,null,null,null,null,null,null,null,null,null,null,null,{"$f":"VLOOKUP(B27,_config!$A$3:$B$41,2)","v":{"$error":"#N/A"}}]
[null,null,null,null,null,null,null,null,null,null,null,null,{"$f":"VLOOKUP(B28,_config!$A$3:$B$41,2)","v":{"$error":"#N/A"}}]
[null,null,null,null,null,null,null,null,null,null,null,null,{"$f":"VLOOKUP(B29,_config!$A$3:$B$41,2)","v":{"$error":"#N/A"}}]
[null,null,null,null,null,null,null,null,null,null,null,null,{"$f":"VLOOKUP(B30,_config!$A$3:$B$41,2)","v":{"$error":"#N/A"}}]
[null,null,null,null,null,null,null,null,null,null,null,null,{"$f":"VLOOKUP(B31,_config!$A$3:$B$41,2)","v":{"$error":"#N/A"}}]
[null,null,null,null,null,null,null,null,null,null,null,null,{"$f":"VLOOKUP(B32,_config!$A$3:$B$41,2)","v":{"$error":"#N/A"}}]
[null,null,null,null,null,null,null,null,null,null,null,null,{"$f":"VLOOKUP(B33,_config!$A$3:$B$41,2)","v":{"$error":"#N/A"}}]
[null,null,null,null,null,null,null,null,null,null,null,null,{"$f":"VLOOKUP(B34,_config!$A$3:$B$41,2)","v":{"$error":"#N/A"}}]
[null,null,null,null,null,null,null,null,null,null,null,null,{"$f":"VLOOKUP(B35,_config!$A$3:$B$41,2)","v":{"$error":"#N/A"}}]
[null,null,null,null,null,null,null,null,null,null,null,null,{"$f":"VLOOKUP(B36,_config!$A$3:$B$41,2)","v":{"$error":"#N/A"}}]
[null,null,null,null,null,null,null,null,null,null,null,null,{"$f":"VLOOKUP(B37,_config!$A$3:$B$41,2)","v":{"$error":"#N/A"}}]
[null,null,null,null,null,null,null,null,null,null,null,null,{"$f":"VLOOKUP(B38,_config!$A$3:$B$41,2)","v":{"$error":"#N/A"}}]
[null,null,null,null,null,null,null,null,null,null,null,null,{"$f":"VLOOKUP(B39,_config!$A$3:$B$41,2)","v":{"$error":"#N/A"}}]
[null,null,null,null,null,null,null,null,null,null,null,null,{"$f":"VLOOKUP(B40,_config!$A$3:$B$41,2)","v":{"$error":"#N/A"}}]
[null,null,null,null,null,null,null,null,null,null,null,null,{"$f":"VLOOKUP(B41,_config!$A$3:$B$41,2)","v":{"$error":"#N/A"}}]
[null,null,null,null,null,null,null,null,null,null,null,null,{"$f":"VLOOKUP(B42,_config!$A$3:$B$41,2)","v":{"$error":"#N/A"}}]
[null,null,null,null,null,null,null,null,null,null,null,null,{"$f":"VLOOKUP(B43,_config!$A$3:$B$41,2)","v":{"$error":"#N/A"}}]
[null,null,null,null,null,null,null,null,null,null,null,null,{"$f":"VLOOKUP(B44,_config!$A$3:$B$41,2)","v":{"$error":"#N/A"}}]
[null,null,null,null,null,null,null,null,null,null,null,null,{"$f":"VLOOKUP(B45,_config!$A$3:$B$41,2)","v":{"$error":"#N/A"}}]
[null,null,null,null,null,null,null,null,null,null,null,null,{"$f":"VLOOKUP(B46,_config!$A$3:$B$41,2)","v":{"$error":"#N/A"}}]
[null,null,null,null,null,null,null,null,null,null,null,null,{"$f":"VLOOKUP(B47,_config!$A$3:$B$41,2)","v":{"$error":"#N/A"}}]
[null,null,null,null,null,null,null,null,null,null,null,null,{"$f":"VLOOKUP(B48,_config!$A$3:$B$41,2)","v":{"$error":"#N/A"}}]
[null,null,null,null,null,null,null,null,null,null,null,null,{"$f":"VLOOKUP(B49,_config!$A$3:$B$41,2)","v":{"$error":"#N/A"}}]
[null,null,null,null,null,null,null,null,null,null,null,null,{"$f":"VLOOKUP(B50,_config!$A$3:$B$41,2)","v":{"$error":"#N/A"}}]
[null,null,null,null,null,null,null,null,null,null,null,null,{"$f":"VLOOKUP(B51,_config!$A$3:$B$41,2)","v":{"$error":"#N/A"}}]
[null,null,null,null,null,null,null,null,null,null,null,null,{"$f":"VLOOKUP(B52,_config!$A$3:$B$41,2)","v":{"$error":"#N/A"}}]
[null,null,null,null,null,null,null,null,null,null,null,null,{"$f":"VLOOKUP(B53,_config!$A$3:$B$41,2)","v":{"$error":"#N/A"}}]
[null,null,null,null,null,null,null,null,null,null,null,null,{"$f":"VLOOKUP(B54,_config!$A$3:$B$41,2)","v":{"$error":"#N/A"}}]
[null,null,null,null,null,null,null,null,null,null,null,null,{"$f":"VLOOKUP(B55,_config!$A$3:$B$41,2)","v":{"$error":"#N/A"}}]
[null,null,null,null,null,null,null,null,null,null,null,null,{"$f":"VLOOKUP(B56,_config!$A$3:$B$41,2)","v":{"$error":"#N/A"}}]
[null,null,null,null,null,null,null,null,null,null,null,null,{"$f":"VLOOKUP(B57,_config!$A$3:$B$41,2)","v":{"$error":"#N/A"}}]
[null,null,null,null,null,null,null,null,null,null,null,null,{"$f":"VLOOKUP(B58,_config!$A$3:$B$41,2)","v":{"$error":"#N/A"}}]
[null,null,null,null,null,null,null,null,null,null,null,null,{"$f":"VLOOKUP(B59,_config!$A$3:$B$41,2)","v":{"$error":"#N/A"}}]
[null,null,null,null,null,null,null,null,null,null,null,null,{"$f":"VLOOKUP(B60,_config!$A$3:$B$41,2)","v":{"$error":"#N/A"}}]
{"$rows_left_out":18}
{"sheet":"5 | Doc. Sistema di Gestione ","index":4,"n_rows":64,"n_cols":6,"rows_kept":64,"cut":false,"hidden":false,"merged":[[10,1,10,3],[4,1,4,5],[1,0,1,2],[0,0,0,2],[9,1,9,3],[9,4,9,5],[6,1,6,5]]}
[{"$f":"'4 | Tabella Accreditamento'!A1:B1","v":"Dipartimento Laboratori di Taratura"}]
[{"$f":"'1 | Informazioni generali'!A2","v":"DA-09 rev. 00-05"}]
[]
[]
["5","Documentazione del Sistema di Gestione - Procedure gestionali e tecniche"]
[]
["Scopo:","Identificare la documentazione del sistema di gestione (incluse procedure gestionali e tecniche) utilizzata dall'organismo, nello stato di revisione corrente e segnalando eventuali variazioni rispetto a precedenti versioni (già valutate positivamente da ACCREDIA-DT)."]
[]
["Note:"]
["(1)","Numero progressivo, da utilizzarsi nella descrizione della Tabella di Accreditamento (sezione 4).",null,null,"Vai alla Tabella di Accreditamento >>>"]
["(2)","Indicare eventuali variazioni rispetto alle procedure già positivamente valutate da ACCREDIA-DT (nel caso di domanda di Rinnovo o di Estensione/Riduzione). [Doppio click per selezionare/deselezionare]"]
[]
[]
["ID\n(1)","Procedura tecnica / gestionale","Sigla / codice di identificazione","Titolo","Indice di revisione","Variazione\n(2)"]
[{"$f":"IF(B15=\"\",\"\",1)","v":""}]
[{"$f":"IF(B16=\"\",\"\",IF(A15=\"\",\"\",A15+1))","v":""}]
[{"$f":"IF(B17=\"\",\"\",IF(A16=\"\",\"\",A16+1))","v":""}]
[""]
[""]
[""]
[""]
[""]
[""]
[""]
[""]
[""]
[""]
[""]
[""]
[""]
[""]
[""]
[""]
[""]
[""]
[""]
[""]
[""]
[""]
[""]
[""]
[""]
[""]
[""]
[""]
[""]
[""]
[""]
[""]
[""]
[""]
[""]
[""]
[""]
[""]
[""]
[""]
[""]
[""]
[""]
{"$rows_left_out":5}
{"sheet":"6 | Campioni e strumenti","index":5,"n_rows":59,"n_cols":15,"rows_kept":59,"cut":false,"hidden":false,"merged":[[4,1,4,14],[1,0,1,1],[0,0,0,1],[16,10,16,14],[9,1,9,14],[10,1,10,14],[12,1,12,14],[14,1,14,14],[11,1,11,14],[6,1,6,14],[13,1,13,9],[13,10,13,12]]}
[{"$f":"'4 | Tabella Accreditamento'!A1:B1","v":"Dipartimento Laboratori di Taratura"}]
[{"$f":"'1 | Informazioni generali'!A2","v":"DA-09 rev. 00-05"}]
[]
[]
["6","Elenco dei campioni e/o strumenti"]
[]
["Scopo:","Riportare l'elenco completo dei campioni e degli strumenti (compresi quelli eventualmente non di proprietà) utilizzati dall'organismo per le produzioni oggetto di accreditamento."]
[]
["Note:"]
["(1)","Numero progressivo."]
["(2)","Indicare se (cfr. UNI CEI 70099:2008) \n campione di misura di riferimento (cfr. §5.6) - in precedenza, \"campione di prima linea\" \n campione di misura di lavoro (cfr. §5.7) - in precedenza, \"campione di seconda linea\"\n campione di misura viaggiatore (cfr. §5.8)\n dispositivo di misura di trasferimento (cfr. §5.9).    "]
["(3)","Selezionare nel caso in cui il campione/strumento non sia di proprietà dell'organismo. [Doppio click per selezionare/deselezionare] Riportare il proprietario nella colonna successiva."]
["(4)","Selezionare se soggetto a taratura interna (cfr. RT-25), ovvero ad una taratura eseguita per stabilire la riferibilità metrologica delle proprie attività in relazione allo scopo di accreditamento e che\n non rientra nello scopo di accreditamento del LAT (e come tale non può essere offerta come servizio di taratura accreditato),\n viene eseguita mediante personale e strumentazione sotto il diretto ed esclusivo controllo del LAT o della organizzazione a cui il LAT appartiene, applicando procedure tecniche valutate positivamente da parte di ACCREDIA-DT."]
["(5)","Indicare la procedura (o le procedure) utilizzando il relativo ID di cui all'elenco delle procedure (sezione 5).",null,null,null,null,null,null,null,null,"Vai all'elenco procedure >>>"]
["(6)","Non indicare nel caso di taratura interna. [Doppio click per selezionare/deselezionare]"]
[]
[null,null,null,null,null,null,null,null,null,"Utilizzo","Taratura"]
["ID\n(1)","Tipo di strumento\n(2)","Non di proprietà\n(3)","Proprietario","Descrizione","Costruttore","Data di costruzione\n(anno)","Modello / tipo","Numero di matricola","Procedura\n(5)","Interna\n(4)","Periodicità\n(mesi)","Procedura\n(5)","Fornitore\n(6)","Numero / data dell'ultimo Certificato di Taratura"]
[1,"Dispositivo di misura di trasferimento"]
[{"$f":"IF(B20=\"\",\"\",IF(A19=\"\",\"\",(A19+1)))","v":""}]
[{"$f":"IF(B21=\"\",\"\",IF(A20=\"\",\"\",(A20+1)))","v":""}]
[""]
[""]
[""]
[""]
[""]
[""]
[""]
[""]
[""]
[""]
[""]
[""]
[""]
[""]
[""]
[""]
[""]
[""]
[""]
[""]
[""]
[""]
[""]
[""]
[""]
[""]
[""]
[""]
[""]
[""]
[""]
[""]
[""]
[""]
[""]
[""]
[""]
[""]

{"sheet":"7 | Allegati","index":6,"n_rows":29,"n_cols":16,"rows_kept":29,"cut":false,"hidden":false,"merged":[[28,1,28,10],[0,0,0,2],[4,1,4,10],[26,1,26,10],[12,1,12,10],[16,1,16,10],[18,1,18,10],[22,1,22,10],[10,1,10,10],[20,1,20,10],[4,15,6,15],[24,1,24,10],[4,12,6,12],[4,13,6,13],[6,1,6,10],[4,11,6,11],[4,14,6,14],[8,1,8,10],[14,1,14,10]]}
[{"$f":"'4 | Tabella Accreditamento'!A1:B1","v":"Dipartimento Laboratori di Taratura"}]
[{"$f":"'1 | Informazioni generali'!A2","v":"DA-09 rev. 00-05"}]
[]
[]
["7","Allegati da inviare a corredo della presente domanda",null,null,null,null,null,null,null,null,null,"Accreditamento","Estensione","Riduzione","Rinnovo","Variazione anagrafica /\nTrasferimento di titolarità"]
[]
["Nota:","Il mancato invio di tutti gli allegati richiesti rappresenta elemento sufficiente per la non accettabilità dell'intera domanda. "]
[]
["A.1","Piano di produzione",null,null,null,null,null,null,null,null,null,"X","X","X","X"]
[]
["A.2","Organigramma nominativo della struttura dell'organismo che richiede l'accreditamento come produttore di materiali di riferimento, nel quale siano almeno indicate le persone riportate nella sez. 2.",null,null,null,null,null,null,null,null,null,"X","X","X","X","X"]
[]
["A.3","Curriculum professionale, datato e firmato, di tutto il personale indicato nella sez. 2.",null,null,null,null,null,null,null,null,null,"X","X",null,"X","X"]
[]
["A.4","Copia dei contratti in essere con i subappaltatori elencati nella sez. 3.",null,null,null,null,null,null,null,null,null,"X","X",null,"X","X"]
[]
["A.5","Manuale del Sistema di Gestione in formato elettronico PDF (in distrbuzione controllata), in conformità a quanto previsto dalla norma ISO 17034, ai requisiti aggiuntivi di ACCREDIA, dell’EA e dell’ILAC.",null,null,null,null,null,null,null,null,null,"X","X","X","X","X"]
[]
["A.6","Procedure gestionali e tecniche (come da elenco riportato in sez. 5) - e relativi allegati -, nell’ultima revisione, in formato elettronico PDF (in distribuzione controllata). ",null,null,null,null,null,null,null,null,null,"X","X","X","X","X"]
[]
["A.7","Copia dei Certificati di Taratura (in formato elettronico PDF) per i campioni di misura di riferimento in dotazione all'organismo.",null,null,null,null,null,null,null,null,null,"X","X",null,null,"X"]
[]
["A.8","Eventuali evidenze della partecipazione (o delle risultanze, ove disponibili) a PT e/o ILC. \nSe non altrimenti predisposto, è possibile utilizzare lo schema di cui alla sez. 5.2 della vigente DA-05.",null,null,null,null,null,null,null,null,null,"X","X",null,"X","X"]
[]
["A.9","Lista di riscontro (DT-Mod-014-RMP) debitamente compilata per la valutazione dell'organismo.",null,null,null,null,null,null,null,null,null,"X","X",null,"X","X"]
[]
["A.10","Verbale dell'ultimo riesame della Direzione, contenente tutte le informazioni riportate al punto 8.6 della ISO 17034 che comprenda i risultati di un ciclo completo di audit interno.",null,null,null,null,null,null,null,null,null,"X"]
[]
["A.11","Valutazione possibili effetti della riduzione sugli altri campi accreditati (vedi RG-18 6.2.1).",null,null,null,null,null,null,null,null,null,null,null,"X"]

{"sheet":"_config","index":7,"n_rows":41,"n_cols":10,"rows_kept":41,"cut":false,"hidden":true,"merged":[]}
["Grandezze",null,null,"Settore",null,"Tipo di procedura (tecnica/gestionale)",null,"Tipo di campione/strumento",null,"Domanda"]
[]
["(Grandezza non codificata)","NOCOD",null,"[SRM-01] Materiali di riferimento (RM o CRM) in matrice ambientale",null,"Tecnica",null,"Campione di misura di riferimento",null,"ACCREDITAMENTO"]
["[LAT] ACCELERAZIONE","SAC",null,"[SRM-02] Materiali di riferimento (RM o CRM) sintetici in soluzione",null,"Gestionale",null,"Campione di misura di lavoro",null,"ESTENSIONE"]
["[LAT] ANGOLO PIANO","SAP",null,"[SRM-03] Materiali di riferimento (RM o CRM) gassosi",null,null,null,"Campione di misura viaggiatore",null,"RIDUZIONE"]
["[LAT] ATTIVITA' CATALITICA","SCT",null,null,null,null,null,"Dispositivo di misura di trasferimento",null,"RINNOVO con conferma della Tabella di Accreditamento"]
["[LAT] CAMPO ELETTROMAGNETICO","SEM",null,null,null,null,null,null,null,"RINNOVO con richiesta variazioni della Tabella di Accreditamento"]
["[LAT] CONCENTRAZIONE DI QUANTITA' DI SOSTANZA","SCQ",null,null,null,"Ruolo",null,"Attività di produzione",null,"VARIAZIONE ANAGRAFICA o TRASFERIMENTO DI TITOLARITA'"]
["[LAT] CONDUCIBILITA' ELETTROLITICA","SCL"]
["[LAT] DEFORMAZIONE","SDE",null,null,null,"Responsabile del Laboratorio",null,"Lavorazione materiale"]
["[LAT] DUREZZA","SDR",null,null,null,"Sostituto del Responsabile",null,"Manipolazione",null,"Luogo di taratura/produzione"]
["[LAT] FORZA","SFO",null,null,null,"Responsabile UOD",null,"Valutazione omogeneità"]
["[LAT] FRAZIONE DI QUANTITA' DI SOSTANZA","SFQ",null,null,null,"Responsabile del Sistema di Gestione",null,"Valutazione stabilità",null,"nel Laboratorio principale"]
["[LAT] INDUZIONE MAGNETICA","SIM",null,null,null,"Assistente del Responsabile del Sistema di Gestione",null,"Caratterizzazione",null,"in unità operativa distaccata (UOD)"]
["[LAT] IRRADIANZA","SIR",null,null,null,"Operatore",null,"Immagazzinamento",null,"in unità operativa temporanea (UOT)"]
["[LAT] LUNGHEZZA","SLN",null,null,null,null,null,"Distribuzione",null,"in unità operativa mobile (UOM)"]
["[LAT] MASSA","SMA"]
["[LAT] MASSA VOLUMICA","SMV",null,null,null,"Direzione"]
["[LAT] MISURE A RADIOFREQUENZA (RF)","SRF",null,null,null,"Direzione Tecnica"]
["[LAT] MISURE ACUSTICHE","SAU",null,null,null,"Responsabile UOD/UOT/UOM"]
["[LAT] MISURE DI TEMPO E FREQUENZA","STF",null,null,null,"Responsabile del Sistema di Gestione"]
["[LAT] MISURE ELETTRICHE IN CONTINUA E BASSA FREQUENZA","SBF",null,null,null,"Operatore"]
["[LAT] MISURE OTTICHE","SOT"]
["[LAT] MOMENTO TORCENTE","SMT"]
["[LAT] pH","SPH"]
["[LAT] PORTATA","SPO"]
["[LAT] PORTATA IN VOLUME","SPV"]
["[LAT] PORTATA IN VOLUME DI LIQUIDI","SPL"]
["[LAT] POTENZA TERMICA","SPT"]
["[LAT] PRESSIONE","SPR"]
["[LAT] QUANTITA' DI SOSTANZA","SQS"]
["[LAT] RADIAZIONI IONIZZANTI","SRI"]
["[LAT] TEMPERATURA","STE"]
["[LAT] TEMPERATURA DI RUGIADA","STR"]
["[LAT] UMIDITA' RELATIVA","SHR"]
["[LAT] VELOCITA'","SVE"]
["[LAT] VELOCITA' DELL'ARIA","SVA"]
["[LAT] VOLUME","SVO"]
["[LAT] VOLUME STATICO DI LIQUIDI","SVS"]
["[LAT] VOLUME TOTALIZZATO DI LIQUIDI","SVT"]
["[RMP] MATERIALI DI RIFERIMENTO","SRM"]